{"text_format":"3","workbook":"xlsx","n_sheets":9,"sheets":["Main Menu","SheetVisibility","RefList","SchedulePlanner","Weekly Schedule","Player Contribution","AGL Teams","12OunceHcapRoster","EHS Restriction"],"not_rendered":{"images":3,"macros":1,"external_links":1,"defined_names":391},"read":"whole","date_system":"1900"}

{"sheet":"Main Menu","index":0,"n_rows":0,"n_cols":0,"rows_kept":0}

{"sheet":"SheetVisibility","index":1,"n_rows":10,"n_cols":4,"rows_kept":10}
["Sheet Name","CodeName","Visibility","Visible\nHidden\nVeryHidden"]
["Main Menu","Sheet9",{"$f":"IF(D2=\"xlSheetVeryHidden\",2,IF(D2=\"xlSheetHidden\",0,-1))","v":2},"xlSheetVeryHidden"]
["SheetVisibility","programmerSheetVisibility",{"$f":"IF(D3=\"xlSheetVeryHidden\",2,IF(D3=\"xlSheetHidden\",0,-1))","v":0},"xlSheetHidden"]
["RefList","Sheet8",2,"xlSheetVeryHidden"]
["SchedulePlanner","Sheet11",2,"xlSheetVeryHidden"]
["Weekly Schedule","Sheet1",-1,"xlSheetVisible"]
["Player Contribution","Sheet2",-1,"xlSheetVisible"]
["AGL Teams","Sheet3",2,"xlSheetVeryHidden"]
{"$rows_left_out":3}
{"sheet":"RefList","index":2,"n_rows":1,"n_cols":1,"rows_kept":1}
["No External References In This Workbook"]

{"sheet":"SchedulePlanner","index":3,"n_rows":64,"n_cols":19,"rows_kept":64,"merged":[[0,0,0,10]]}
["12 Ounce Handicap - 2016 Playing Schedule"]
["Week",{"$f":"'Weekly Schedule'!B3","v":"Smiley"},{"$f":"'Weekly Schedule'!C3","v":"Laces"},{"$f":"'Weekly Schedule'!D3","v":"BB"},{"$f":"'Weekly Schedule'!E3","v":"Lewis"},{"$f":"'Weekly Schedule'!F3","v":"Cooler Dude"},{"$f":"'Weekly Schedule'!G3","v":"Yates"},null,"X","Beer","Total","Front","Back",null,"Laces","BB","Lewis","Cooler Dude","Yates"]
["2016-06-07","X","X","Bye","X","Bye","X",null,{"$f":"COUNTIF(B3:G3,\"X\")","v":4},{"$f":"COUNTIF(B3:G3,\"Beer\")","v":0},{"$f":"I3+J3","v":4},{"$f":"IF('Weekly Schedule'!L4=\"\",\"x\",\"\")","v":""},{"$f":"IF(L3=\"\",\"x\",\"\")","v":"x"},"Smiley",6,5,7,4,7]
[{"$f":"A3+7","v":"2016-06-14"},"X","X","X","Bye","Bye","X",null,{"$f":"COUNTIF(B4:G4,\"X\")","v":4},{"$f":"COUNTIF(B4:G4,\"Beer\")","v":0},{"$f":"I4+J4","v":4},{"$f":"IF('Weekly Schedule'!L5=\"\",\"x\",\"\")","v":"x"},"","Laces",null,6,5,7,5]
["2016-06-21","X","X","X","Bye","Bye","Bye",null,3,0,3,{"$f":"IF('Weekly Schedule'!L6=\"\",\"x\",\"\")","v":""},"x","BB",null,null,6,5,7]
["2016-06-28","Bye","X","X","X","X","Bye",null,4,0,4,{"$f":"IF('Weekly Schedule'!L7=\"\",\"x\",\"\")","v":"x"},"","Lewis",{"$nulls":3},6,6]
["2016-07-05","X","Bye","Bye","X","X","X",null,4,0,4,{"$f":"IF('Weekly Schedule'!L8=\"\",\"x\",\"\")","v":""},"x","Cooler Dude",{"$nulls":4},5]
["2016-07-12","Bye","Bye","X","X","X","X",null,4,0,4,{"$f":"IF('Weekly Schedule'!L9=\"\",\"x\",\"\")","v":"x"},""]
{"$rows_left_out":57}
{"sheet":"Weekly Schedule","index":4,"n_rows":66,"n_cols":26,"rows_kept":66,"merged":[[1,0,1,10],[1,11,1,12],[1,13,1,25],[2,16,2,25],[3,7,5,7],[6,7,8,7],[9,7,11,7],[12,7,14,7],[15,7,17,7]]}
["AGLID","2006_062","2006_016","2013_009","2014_011","2006_070","2015_013"]
[{"$f":"SchedulePlanner!A1","v":"12 Ounce Handicap - 2016 Playing Schedule"},{"$nulls":10},"Starting Hole",null,"Opposing Team"]
["Week",{"$f":"IF(VLOOKUP(B1,'12OunceHcapRoster'!$A$2:$AA$9,11,FALSE)<>\"\",VLOOKUP(B1,'12OunceHcapRoster'!$A$2:$AA$9,11,FALSE),VLOOKUP(B1,'12OunceHcapRoster'!$A$2:$AA$9,6,FALSE))","v":"Smiley"},{"$f":"IF(VLOOKUP(C1,'12OunceHcapRoster'!$A$2:$AA$9,11,FALSE)<>\"\",VLOOKUP(C1,'12OunceHcapRoster'!$A$2:$AA$9,11,FALSE),VLOOKUP(C1,'12OunceHcapRoster'!$A$2:$AA$9,6,FALSE))","v":"Laces"},{"$f":"IF(VLOOKUP(D1,'12OunceHcapRoster'!$A$2:$AA$9,11,FALSE)<>\"\",VLOOKUP(D1,'12OunceHcapRoster'!$A$2:$AA$9,11,FALSE),VLOOKUP(D1,'12OunceHcapRoster'!$A$2:$AA$9,6,FALSE))","v":"BB"},{"$f":"IF(VLOOKUP(E1,'12OunceHcapRoster'!$A$2:$AA$9,11,FALSE)<>\"\",VLOOKUP(E1,'12OunceHcapRoster'!$A$2:$AA$9,11,FALSE),VLOOKUP(E1,'12OunceHcapRoster'!$A$2:$AA$9,6,FALSE))","v":"Lewis"},{"$f":"IF(VLOOKUP(F1,'12OunceHcapRoster'!$A$2:$AA$9,11,FALSE)<>\"\",VLOOKUP(F1,'12OunceHcapRoster'!$A$2:$AA$9,11,FALSE),VLOOKUP(F1,'12OunceHcapRoster'!$A$2:$AA$9,6,FALSE))","v":"Cooler Dude"},{"$f":"IF(VLOOKUP(G1,'12OunceHcapRoster'!$A$2:$AA$9,11,FALSE)<>\"\",VLOOKUP(G1,'12OunceHcapRoster'!$A$2:$AA$9,11,FALSE),VLOOKUP(G1,'12OunceHcapRoster'!$A$2:$AA$9,6,FALSE))","v":"Yates"},"Robin","X","Beer","Total","Back","Front","Number","Name","Captain","Players"]
[{"$f":"SchedulePlanner!A3","v":"2016-06-07"},{"$f":"SchedulePlanner!B3","v":"X"},{"$f":"SchedulePlanner!C3","v":"X"},{"$f":"SchedulePlanner!D3","v":"Bye"},{"$f":"SchedulePlanner!E3","v":"X"},{"$f":"SchedulePlanner!F3","v":"Bye"},{"$f":"SchedulePlanner!G3","v":"X"},1,{"$f":"COUNTIF(B4:G4,\"X\")","v":4},{"$f":"COUNTIF(B4:G4,\"Beer\")","v":0},{"$f":"I4+J4","v":4},15,null,3,{"$f":"VLOOKUP(N4,'AGL Teams'!$A$2:$O$17,2,FALSE)","v":"Hack Attack"},{"$f":"VLOOKUP($N4,'AGL Teams'!$A$2:$O$17,COLUMN()-11,FALSE)","v":"2014_006"},{"$f":"VLOOKUP($N4,'AGL Teams'!$A$2:$O$17,COLUMN()-11,FALSE)","v":"2014_006"},{"$f":"VLOOKUP($N4,'AGL Teams'!$A$2:$O$17,COLUMN()-11,FALSE)","v":"2014_005"},{"$f":"VLOOKUP($N4,'AGL Teams'!$A$2:$O$17,COLUMN()-11,FALSE)","v":"2014_009"},{"$f":"VLOOKUP($N4,'AGL Teams'!$A$2:$O$17,COLUMN()-11,FALSE)","v":"2015_002"},{"$f":"VLOOKUP($N4,'AGL Teams'!$A$2:$O$17,COLUMN()-11,FALSE)","v":"2014_010"},{"$f":"VLOOKUP($N4,'AGL Teams'!$A$2:$O$17,COLUMN()-11,FALSE)","v":"2015_004"},{"$f":"VLOOKUP($N4,'AGL Teams'!$A$2:$O$17,COLUMN()-11,FALSE)","v":0},{"$f":"VLOOKUP($N4,'AGL Teams'!$A$2:$O$17,COLUMN()-11,FALSE)","v":0},{"$f":"VLOOKUP($N4,'AGL Teams'!$A$2:$O$17,COLUMN()-11,FALSE)","v":0},{"$f":"VLOOKUP($N4,'AGL Teams'!$A$2:$O$17,COLUMN()-11,FALSE)","v":0}]
[{"$f":"SchedulePlanner!A4","v":"2016-06-14"},{"$f":"SchedulePlanner!B4","v":"X"},{"$f":"SchedulePlanner!C4","v":"X"},{"$f":"SchedulePlanner!D4","v":"X"},{"$f":"SchedulePlanner!E4","v":"Bye"},{"$f":"SchedulePlanner!F4","v":"Bye"},{"$f":"SchedulePlanner!G4","v":"X"},null,{"$f":"COUNTIF(B5:G5,\"X\")","v":4},{"$f":"COUNTIF(B5:G5,\"Beer\")","v":0},{"$f":"I5+J5","v":4},null,1,15,{"$f":"VLOOKUP(N5,'AGL Teams'!$A$2:$O$17,2,FALSE)","v":"Stress Relief"},{"$f":"VLOOKUP($N5,'AGL Teams'!$A$2:$O$17,COLUMN()-11,FALSE)","v":"2006_090"},{"$f":"VLOOKUP($N5,'AGL Teams'!$A$2:$O$17,COLUMN()-11,FALSE)","v":"2006_090"},{"$f":"VLOOKUP($N5,'AGL Teams'!$A$2:$O$17,COLUMN()-11,FALSE)","v":"2006_015"},{"$f":"VLOOKUP($N5,'AGL Teams'!$A$2:$O$17,COLUMN()-11,FALSE)","v":"2006_032"},{"$f":"VLOOKUP($N5,'AGL Teams'!$A$2:$O$17,COLUMN()-11,FALSE)","v":"2006_078"},{"$f":"VLOOKUP($N5,'AGL Teams'!$A$2:$O$17,COLUMN()-11,FALSE)","v":"2006_079"},{"$f":"VLOOKUP($N5,'AGL Teams'!$A$2:$O$17,COLUMN()-11,FALSE)","v":"2015_003"},{"$f":"VLOOKUP($N5,'AGL Teams'!$A$2:$O$17,COLUMN()-11,FALSE)","v":0},{"$f":"VLOOKUP($N5,'AGL Teams'!$A$2:$O$17,COLUMN()-11,FALSE)","v":0},{"$f":"VLOOKUP($N5,'AGL Teams'!$A$2:$O$17,COLUMN()-11,FALSE)","v":0},{"$f":"VLOOKUP($N5,'AGL Teams'!$A$2:$O$17,COLUMN()-11,FALSE)","v":0}]
[{"$f":"SchedulePlanner!A5","v":"2016-06-21"},{"$f":"SchedulePlanner!B5","v":"X"},{"$f":"SchedulePlanner!C5","v":"X"},{"$f":"SchedulePlanner!D5","v":"X"},{"$f":"SchedulePlanner!E5","v":"Bye"},{"$f":"SchedulePlanner!F5","v":"Bye"},{"$f":"SchedulePlanner!G5","v":"Bye"},null,3,0,3,12,null,5,{"$f":"VLOOKUP(N6,'AGL Teams'!$A$2:$O$17,2,FALSE)","v":"Big Knockers"},{"$f":"VLOOKUP($N6,'AGL Teams'!$A$2:$O$17,COLUMN()-11,FALSE)","v":"2006_041"},{"$f":"VLOOKUP($N6,'AGL Teams'!$A$2:$O$17,COLUMN()-11,FALSE)","v":"2006_041"},{"$f":"VLOOKUP($N6,'AGL Teams'!$A$2:$O$17,COLUMN()-11,FALSE)","v":"2006_025"},{"$f":"VLOOKUP($N6,'AGL Teams'!$A$2:$O$17,COLUMN()-11,FALSE)","v":"2006_029"},{"$f":"VLOOKUP($N6,'AGL Teams'!$A$2:$O$17,COLUMN()-11,FALSE)","v":"2008_002"},{"$f":"VLOOKUP($N6,'AGL Teams'!$A$2:$O$17,COLUMN()-11,FALSE)","v":"2006_058"},{"$f":"VLOOKUP($N6,'AGL Teams'!$A$2:$O$17,COLUMN()-11,FALSE)","v":"2011_007"},{"$f":"VLOOKUP($N6,'AGL Teams'!$A$2:$O$17,COLUMN()-11,FALSE)","v":0},{"$f":"VLOOKUP($N6,'AGL Teams'!$A$2:$O$17,COLUMN()-11,FALSE)","v":0},{"$f":"VLOOKUP($N6,'AGL Teams'!$A$2:$O$17,COLUMN()-11,FALSE)","v":0},{"$f":"VLOOKUP($N6,'AGL Teams'!$A$2:$O$17,COLUMN()-11,FALSE)","v":0}]
[{"$f":"SchedulePlanner!A6","v":"2016-06-28"},{"$f":"SchedulePlanner!B6","v":"Bye"},{"$f":"SchedulePlanner!C6","v":"X"},{"$f":"SchedulePlanner!D6","v":"X"},{"$f":"SchedulePlanner!E6","v":"X"},{"$f":"SchedulePlanner!F6","v":"X"},{"$f":"SchedulePlanner!G6","v":"Bye"},2,4,0,4,null,8,13,{"$f":"VLOOKUP(N7,'AGL Teams'!$A$2:$O$17,2,FALSE)","v":"Crooked Shanks"},{"$f":"VLOOKUP($N7,'AGL Teams'!$A$2:$O$17,COLUMN()-11,FALSE)","v":"2011_004"},{"$f":"VLOOKUP($N7,'AGL Teams'!$A$2:$O$17,COLUMN()-11,FALSE)","v":"2011_004"},{"$f":"VLOOKUP($N7,'AGL Teams'!$A$2:$O$17,COLUMN()-11,FALSE)","v":"2016_007"},{"$f":"VLOOKUP($N7,'AGL Teams'!$A$2:$O$17,COLUMN()-11,FALSE)","v":"2013_003"},{"$f":"VLOOKUP($N7,'AGL Teams'!$A$2:$O$17,COLUMN()-11,FALSE)","v":"2016_006"},{"$f":"VLOOKUP($N7,'AGL Teams'!$A$2:$O$17,COLUMN()-11,FALSE)","v":"2015_009"},{"$f":"VLOOKUP($N7,'AGL Teams'!$A$2:$O$17,COLUMN()-11,FALSE)","v":"2006_087"},{"$f":"VLOOKUP($N7,'AGL Teams'!$A$2:$O$17,COLUMN()-11,FALSE)","v":0},{"$f":"VLOOKUP($N7,'AGL Teams'!$A$2:$O$17,COLUMN()-11,FALSE)","v":0},{"$f":"VLOOKUP($N7,'AGL Teams'!$A$2:$O$17,COLUMN()-11,FALSE)","v":0},{"$f":"VLOOKUP($N7,'AGL Teams'!$A$2:$O$17,COLUMN()-11,FALSE)","v":0}]
[{"$f":"SchedulePlanner!A7","v":"2016-07-05"},{"$f":"SchedulePlanner!B7","v":"X"},{"$f":"SchedulePlanner!C7","v":"Bye"},{"$f":"SchedulePlanner!D7","v":"Bye"},{"$f":"SchedulePlanner!E7","v":"X"},{"$f":"SchedulePlanner!F7","v":"X"},{"$f":"SchedulePlanner!G7","v":"X"},null,4,0,4,11,null,8,{"$f":"VLOOKUP(N8,'AGL Teams'!$A$2:$O$17,2,FALSE)","v":"Deep Ruff"},{"$f":"VLOOKUP($N8,'AGL Teams'!$A$2:$O$17,COLUMN()-11,FALSE)","v":"2006_083"},{"$f":"VLOOKUP($N8,'AGL Teams'!$A$2:$O$17,COLUMN()-11,FALSE)","v":"2006_083"},{"$f":"VLOOKUP($N8,'AGL Teams'!$A$2:$O$17,COLUMN()-11,FALSE)","v":"2006_001"},{"$f":"VLOOKUP($N8,'AGL Teams'!$A$2:$O$17,COLUMN()-11,FALSE)","v":"2006_036"},{"$f":"VLOOKUP($N8,'AGL Teams'!$A$2:$O$17,COLUMN()-11,FALSE)","v":"2015_014"},{"$f":"VLOOKUP($N8,'AGL Teams'!$A$2:$O$17,COLUMN()-11,FALSE)","v":"2006_052"},{"$f":"VLOOKUP($N8,'AGL Teams'!$A$2:$O$17,COLUMN()-11,FALSE)","v":"2010_008"},{"$f":"VLOOKUP($N8,'AGL Teams'!$A$2:$O$17,COLUMN()-11,FALSE)","v":0},{"$f":"VLOOKUP($N8,'AGL Teams'!$A$2:$O$17,COLUMN()-11,FALSE)","v":0},{"$f":"VLOOKUP($N8,'AGL Teams'!$A$2:$O$17,COLUMN()-11,FALSE)","v":0},{"$f":"VLOOKUP($N8,'AGL Teams'!$A$2:$O$17,COLUMN()-11,FALSE)","v":0}]
{"$rows_left_out":59}
{"sheet":"Player Contribution","index":5,"n_rows":51,"n_cols":26,"rows_kept":51,"merged":[[0,0,0,25],[1,2,1,4],[1,5,1,7],[1,8,1,10],[1,11,1,13],[1,14,1,16],[1,17,1,19],[1,20,1,24],[1,25,2,25],[3,25,5,25],[6,25,8,25],[9,25,11,25],[12,25,14,25],[15,25,17,25],[21,2,21,4],[21,5,21,7],[21,8,21,10],[21,11,21,13],[21,14,21,16],[21,17,21,19],[21,23,23,24],[21,25,23,25]]}
["12 Ounce Handicap - Playing Contribution"]
[null,null,{"$f":"'Weekly Schedule'!B3","v":"Smiley"},null,null,{"$f":"'Weekly Schedule'!C3","v":"Laces"},null,null,{"$f":"'Weekly Schedule'!D3","v":"BB"},null,null,{"$f":"'Weekly Schedule'!E3","v":"Lewis"},null,null,{"$f":"'Weekly Schedule'!F3","v":"Cooler Dude"},null,null,{"$f":"'Weekly Schedule'!G3","v":"Yates"},null,null,"Team Totals",{"$nulls":4},"Robin Points"]
["Date","Event","Indy","Match","Total","Indy","Match","Total","Indy","Match","Total","Indy","Match","Total","Indy","Match","Total","Indy","Match","Total","Indy","Match",{"$f":"\"-Low\"","v":"-Low"},"Points","Total"]
[{"$f":"'Weekly Schedule'!A4","v":"2016-06-07"},"Robin 1 Week 1",9,9,{"$f":"IF(OR(C4=\"BYE\",C4=\"X\",C4=\"Beer\"),\"\",IF(C4=9999,9999,C4+D4))","v":18},7,12,{"$f":"IF(OR(F4=\"BYE\",F4=\"X\",F4=\"Beer\"),\"\",IF(F4=9999,9999,F4+G4))","v":19},9999,{"$f":"I4","v":9999},{"$f":"IF(OR(I4=\"BYE\",I4=\"X\",I4=\"Beer\"),\"\",IF(I4=9999,9999,I4+J4))","v":9999},11,11,{"$f":"IF(OR(L4=\"BYE\",L4=\"X\",L4=\"Beer\"),\"\",IF(L4=9999,9999,L4+M4))","v":22},9999,{"$f":"O4","v":9999},{"$f":"IF(OR(O4=\"BYE\",O4=\"X\",O4=\"Beer\"),\"\",IF(O4=9999,9999,O4+P4))","v":9999},12,9,{"$f":"IF(OR(R4=\"BYE\",R4=\"X\",R4=\"Beer\"),\"\",IF(R4=9999,9999,R4+S4))","v":21},{"$f":"IF(OR(C4=\"BYE\",C4=9999,C4=\"Beer\",C4=\"X\"),0,C4)+IF(OR(F4=\"BYE\",F4=9999,F4=\"Beer\",F4=\"X\"),0,F4)+IF(OR(I4=\"BYE\",I4=9999,I4=\"Beer\",I4=\"X\"),0,I4)+IF(OR(L4=\"BYE\",L4=9999,L4=\"Beer\",L4=\"X\"),0,L4)+IF(OR(O4=\"BYE\",O4=9999,O4=\"Beer\",O4=\"X\"),0,O4)+IF(OR(R4=\"BYE\",R4=9999,R4=\"Beer\",R4=\"X\"),0,R4)","v":39},{"$f":"IF(OR(D4=\"BYE\",D4=9999,D4=\"Beer\",D4=\"X\"),0,D4)+IF(OR(G4=\"BYE\",G4=9999,G4=\"Beer\",G4=\"X\"),0,G4)+IF(OR(J4=\"BYE\",J4=9999,J4=\"Beer\",J4=\"X\"),0,J4)+IF(OR(M4=\"BYE\",M4=9999,M4=\"Beer\",M4=\"X\"),0,M4)+IF(OR(P4=\"BYE\",P4=9999,P4=\"Beer\",P4=\"X\"),0,P4)+IF(OR(S4=\"BYE\",S4=9999,S4=\"Beer\",S4=\"X\"),0,S4)","v":41},{"$f":"IF(OR(C4=\"X\",C4=\"BYE\",C4=\"Beer\",E4+H4+K4+N4+Q4+T4>3*9999),0,MIN(E4,H4,K4,N4,Q4,T4))","v":18},{"$f":"U4+V4-W4","v":62},{"$f":"X4","v":62},4]
[{"$f":"'Weekly Schedule'!A5","v":"2016-06-14"},"Robin 1 Week 2",4,4,8,9,9,18,5,12,17,9999,{"$f":"L5","v":9999},9999,9999,9999,9999,13,8,21,{"$f":"IF(OR(C5=\"BYE\",C5=9999,C5=\"Beer\",C5=\"X\"),0,C5)+IF(OR(F5=\"BYE\",F5=9999,F5=\"Beer\",F5=\"X\"),0,F5)+IF(OR(I5=\"BYE\",I5=9999,I5=\"Beer\",I5=\"X\"),0,I5)+IF(OR(L5=\"BYE\",L5=9999,L5=\"Beer\",L5=\"X\"),0,L5)+IF(OR(O5=\"BYE\",O5=9999,O5=\"Beer\",O5=\"X\"),0,O5)+IF(OR(R5=\"BYE\",R5=9999,R5=\"Beer\",R5=\"X\"),0,R5)","v":31},33,{"$f":"IF(OR(C5=\"X\",C5=\"BYE\",C5=\"Beer\",E5+H5+K5+N5+Q5+T5>3*9999),0,MIN(E5,H5,K5,N5,Q5,T5))","v":8},{"$f":"U5+V5-W5","v":56},{"$f":"Y4+X5","v":118}]
[{"$f":"'Weekly Schedule'!A6","v":"2016-06-21"},"Robin 1 Week 3",11,10,21,7,9,16,9,9,18,9999,9999,9999,9999,9999,9999,9999,{"$f":"R6","v":9999},9999,27,28,{"$f":"IF(OR(C6=\"X\",C6=\"BYE\",C6=\"Beer\",E6+H6+K6+N6+Q6+T6>3*9999),0,MIN(E6,H6,K6,N6,Q6,T6))","v":0},{"$f":"U6+V6-W6","v":55},{"$f":"Y5+X6","v":173}]
[{"$f":"'Weekly Schedule'!A7","v":"2016-06-28"},"Robin 2 Week 1",9999,{"$f":"C7","v":9999},9999,0,0,0,12,9,21,10,8,18,5,8,13,9999,9999,9999,27,25,{"$f":"IF(OR(C7=\"X\",C7=\"BYE\",C7=\"Beer\",E7+H7+K7+N7+Q7+T7>3*9999),0,MIN(E7,H7,K7,N7,Q7,T7))","v":0},{"$f":"U7+V7-W7","v":52},{"$f":"X7","v":52},4]
[{"$f":"'Weekly Schedule'!A8","v":"2016-07-05"},"Robin 2 Week 2",9,9,18,9999,{"$f":"F8","v":9999},9999,8,12,20,9999,9999,9999,6,6,12,7,10,17,30,37,12,55,{"$f":"X8+Y7","v":107}]
{"$rows_left_out":44}
{"sheet":"AGL Teams","index":6,"n_rows":17,"n_cols":15,"rows_kept":17}
["TeamID","Team Name","Team Short Name","TeamID\n(for lookups by Team Name or Team Short Name)","Captain",1,2,3,4,5,6,7,8,9,10]
[1,"Putt-Putts","Putts",1,"2006_007","2006_007","2006_014","2006_035","2015_005","2006_075","2006_091"]
[2,"Tuff Links","Links",2,"2006_053","2006_053","2006_022","2006_040","2006_077","2006_082","2006_088"]
[3,"Hack Attack","Attacks",3,"2014_006","2014_006","2014_005","2014_009","2015_002","2014_010","2015_004"]
[4,"A Flights","Flights",4,"2012_004","2012_004","2007_001","2013_006","2016_001","2014_001","2012_007"]
[5,"Big Knockers","Knockers",5,"2006_041","2006_041","2006_025","2006_029","2008_002","2006_058","2011_007"]
[6,"Greenies","Greenies",6,"2006_012","2006_012","2016_008","2016_010","2016_009","2016_012","2016_011"]
[7,"Happy Gilmores","Gilmores",7,"2006_076","2006_076","2006_059","2006_060","2006_063","2010_003","2006_067"]
{"$rows_left_out":10}
{"sheet":"12OunceHcapRoster","index":7,"n_rows":59,"n_cols":65,"rows_kept":59,"merged":[[26,8,26,11],[27,1,27,3]]}
["AGLID","SeasonID","Playing Status","New Or Returning Player","Player Info Status","Last Name","First Name","MI","Suffix","Full Name","Nickname","Squaw Status","SquawID","Employee Status","EmployeeID","Work Ph","Home Ph","Cell Ph","Pager","Other Ph","Team ID","Team Name","Captain Or Player","Playing Tees","Male Or Female","Email","Other Email","AGLID","EHS","Index","2013 Cash","2013 Certificates","2013 Totals"]
["2006_062",2016,"Active","Returning","Current","Miley","David","G",null,"David Miley","Smiley","Non-Member",null,"Retiree",119951,"??????????","??????????",8173196593,"??????????","??????????",10,"12 Ounce Handicap","Captain","Middle","Male","david@TheMileys.net",null,{"$f":"A2","v":"2006_062"}]
["2006_016",2016,"Active","Returning","Current","Cox","Dewayne",null,null,"Dewayne Cox","Laces","Commissioner","C67","Retiree",null,"??????????","??????????",8177988872,"??????????","??????????",10,"12 Ounce Handicap","Player","Middle","Male","dewaynecox@uwmail.com",null,"2006_016"]
["2013_009",2016,"Active","Returning","Current","Holt","Jim","I",null,"Jim Holt","BB","Member","J21","Employee",null,8177634228,8174418591,8173664958,"??????????",8177398912,10,"12 Ounce Handicap","Player","Middle","Male","jim.i.holt@lmco.com",null,"2013_009",14]
["2014_011",2016,"Active","Returning","Current","Lewis","Josh",null,null,"Josh Lewis",null,"Non-Member",null,"Employee",null,8179353370,null,null,"??????????","??????????",10,"12 Ounce Handicap","Player","Middle","Male","joshua.b.lewis@lmco.com",null,"2014_011"]
["2006_070",2016,"Active","Returning","Current","Pruitt","Bruce","E",null,"Bruce Pruitt","Cooler Dude","Non-Member",null,"Employee",115759,8179353290,8178619037,8173663002,"??????????","??????????",10,"12 Ounce Handicap","Player","Middle","Male","bruce.e.pruitt@lmco.com","brucepruitt@sbcglobal.net","2006_070"]
["2015_013",2016,"Active","Returning","Current","Yates","Rowdy",null,null,"Rowdy Yates",null,"Non-Member",null,"Employee",null,"??????????","??????????","??????????","??????????","??????????",10,"12 Ounce Handicap","Player","Middle","Male",null,null,"2015_013"]
[]
{"$rows_left_out":52}
{"sheet":"EHS Restriction","index":8,"n_rows":26,"n_cols":9,"rows_kept":26,"merged":[[0,0,0,10]]}
["Slice of Life - 2002 EHS Schedule"]
["Week",{"$f":"'12OunceHcapRoster'!B29&\" \"&'12OunceHcapRoster'!D29","v":"David Miley"},{"$f":"'12OunceHcapRoster'!B30&\" \"&'12OunceHcapRoster'!D30","v":"Dewayne Cox"},{"$f":"'12OunceHcapRoster'!B31&\" \"&'12OunceHcapRoster'!D31","v":"Larry Fahrney"},{"$f":"'12OunceHcapRoster'!B32&\" \"&'12OunceHcapRoster'!D32","v":"Vernon Johnson"},{"$f":"'12OunceHcapRoster'!B33&\" \"&'12OunceHcapRoster'!D33","v":"Bruce Pruitt"},{"$f":"'12OunceHcapRoster'!B34&\" \"&'12OunceHcapRoster'!D34","v":"Paul Saunier"},null,"EHS Restriction"]
["2002-06-18",{"$f":"IF(VLOOKUP($A3,'Weekly Schedule'!$A$4:$G$21,1+B$24,FALSE)=\"BYE\",\"BYE\",1)","v":{"$error":"#N/A"}},{"$f":"IF(VLOOKUP($A3,'Weekly Schedule'!$A$4:$G$21,1+C$24,FALSE)=\"BYE\",\"BYE\",1)","v":{"$error":"#N/A"}},{"$f":"IF(VLOOKUP($A3,'Weekly Schedule'!$A$4:$G$21,1+D$24,FALSE)=\"BYE\",\"BYE\",1)","v":{"$error":"#N/A"}},{"$f":"IF(VLOOKUP($A3,'Weekly Schedule'!$A$4:$G$21,1+E$24,FALSE)=\"BYE\",\"BYE\",1)","v":{"$error":"#N/A"}},{"$f":"IF(VLOOKUP($A3,'Weekly Schedule'!$A$4:$G$21,1+F$24,FALSE)=\"BYE\",\"BYE\",1)","v":{"$error":"#N/A"}},{"$f":"IF(VLOOKUP($A3,'Weekly Schedule'!$A$4:$G$21,1+G$24,FALSE)=\"BYE\",\"BYE\",1)","v":{"$error":"#N/A"}},"No of Weeks",5]
[{"$f":"A3+7","v":"2002-06-25"},{"$f":"IF(VLOOKUP($A4,'Weekly Schedule'!$A$4:$G$21,1+B$24,FALSE)=\"BYE\",\"BYE\",1+MAX(B$3:B3))","v":{"$error":"#N/A"}},{"$f":"IF(VLOOKUP($A4,'Weekly Schedule'!$A$4:$G$21,1+C$24,FALSE)=\"BYE\",\"BYE\",1+MAX(C$3:C3))","v":{"$error":"#N/A"}},{"$f":"IF(VLOOKUP($A4,'Weekly Schedule'!$A$4:$G$21,1+D$24,FALSE)=\"BYE\",\"BYE\",1+MAX(D$3:D3))","v":{"$error":"#N/A"}},{"$f":"IF(VLOOKUP($A4,'Weekly Schedule'!$A$4:$G$21,1+E$24,FALSE)=\"BYE\",\"BYE\",1+MAX(E$3:E3))","v":{"$error":"#N/A"}},{"$f":"IF(VLOOKUP($A4,'Weekly Schedule'!$A$4:$G$21,1+F$24,FALSE)=\"BYE\",\"BYE\",1+MAX(F$3:F3))","v":{"$error":"#N/A"}},{"$f":"IF(VLOOKUP($A4,'Weekly Schedule'!$A$4:$G$21,1+G$24,FALSE)=\"BYE\",\"BYE\",1+MAX(G$3:G3))","v":{"$error":"#N/A"}}]
["2002-07-02",{"$f":"IF(VLOOKUP($A5,'Weekly Schedule'!$A$4:$G$21,1+B$24,FALSE)=\"BYE\",\"BYE\",1+MAX(B$3:B4))","v":{"$error":"#N/A"}},{"$f":"IF(VLOOKUP($A5,'Weekly Schedule'!$A$4:$G$21,1+C$24,FALSE)=\"BYE\",\"BYE\",1+MAX(C$3:C4))","v":{"$error":"#N/A"}},{"$f":"IF(VLOOKUP($A5,'Weekly Schedule'!$A$4:$G$21,1+D$24,FALSE)=\"BYE\",\"BYE\",1+MAX(D$3:D4))","v":{"$error":"#N/A"}},{"$f":"IF(VLOOKUP($A5,'Weekly Schedule'!$A$4:$G$21,1+E$24,FALSE)=\"BYE\",\"BYE\",1+MAX(E$3:E4))","v":{"$error":"#N/A"}},{"$f":"IF(VLOOKUP($A5,'Weekly Schedule'!$A$4:$G$21,1+F$24,FALSE)=\"BYE\",\"BYE\",1+MAX(F$3:F4))","v":{"$error":"#N/A"}},{"$f":"IF(VLOOKUP($A5,'Weekly Schedule'!$A$4:$G$21,1+G$24,FALSE)=\"BYE\",\"BYE\",1+MAX(G$3:G4))","v":{"$error":"#N/A"}}]
["2002-07-09",{"$f":"IF(VLOOKUP($A6,'Weekly Schedule'!$A$4:$G$21,1+B$24,FALSE)=\"BYE\",\"BYE\",1+MAX(B$3:B5))","v":{"$error":"#N/A"}},{"$f":"IF(VLOOKUP($A6,'Weekly Schedule'!$A$4:$G$21,1+C$24,FALSE)=\"BYE\",\"BYE\",1+MAX(C$3:C5))","v":{"$error":"#N/A"}},{"$f":"IF(VLOOKUP($A6,'Weekly Schedule'!$A$4:$G$21,1+D$24,FALSE)=\"BYE\",\"BYE\",1+MAX(D$3:D5))","v":{"$error":"#N/A"}},{"$f":"IF(VLOOKUP($A6,'Weekly Schedule'!$A$4:$G$21,1+E$24,FALSE)=\"BYE\",\"BYE\",1+MAX(E$3:E5))","v":{"$error":"#N/A"}},{"$f":"IF(VLOOKUP($A6,'Weekly Schedule'!$A$4:$G$21,1+F$24,FALSE)=\"BYE\",\"BYE\",1+MAX(F$3:F5))","v":{"$error":"#N/A"}},{"$f":"IF(VLOOKUP($A6,'Weekly Schedule'!$A$4:$G$21,1+G$24,FALSE)=\"BYE\",\"BYE\",1+MAX(G$3:G5))","v":{"$error":"#N/A"}}]
["2002-07-16",{"$f":"IF(VLOOKUP($A7,'Weekly Schedule'!$A$4:$G$21,1+B$24,FALSE)=\"BYE\",\"BYE\",1+MAX(B$3:B6))","v":{"$error":"#N/A"}},{"$f":"IF(VLOOKUP($A7,'Weekly Schedule'!$A$4:$G$21,1+C$24,FALSE)=\"BYE\",\"BYE\",1+MAX(C$3:C6))","v":{"$error":"#N/A"}},{"$f":"IF(VLOOKUP($A7,'Weekly Schedule'!$A$4:$G$21,1+D$24,FALSE)=\"BYE\",\"BYE\",1+MAX(D$3:D6))","v":{"$error":"#N/A"}},{"$f":"IF(VLOOKUP($A7,'Weekly Schedule'!$A$4:$G$21,1+E$24,FALSE)=\"BYE\",\"BYE\",1+MAX(E$3:E6))","v":{"$error":"#N/A"}},{"$f":"IF(VLOOKUP($A7,'Weekly Schedule'!$A$4:$G$21,1+F$24,FALSE)=\"BYE\",\"BYE\",1+MAX(F$3:F6))","v":{"$error":"#N/A"}},{"$f":"IF(VLOOKUP($A7,'Weekly Schedule'!$A$4:$G$21,1+G$24,FALSE)=\"BYE\",\"BYE\",1+MAX(G$3:G6))","v":{"$error":"#N/A"}}]
["2002-07-23",{"$f":"IF(VLOOKUP($A8,'Weekly Schedule'!$A$4:$G$21,1+B$24,FALSE)=\"BYE\",\"BYE\",1+MAX(B$3:B7))","v":{"$error":"#N/A"}},{"$f":"IF(VLOOKUP($A8,'Weekly Schedule'!$A$4:$G$21,1+C$24,FALSE)=\"BYE\",\"BYE\",1+MAX(C$3:C7))","v":{"$error":"#N/A"}},{"$f":"IF(VLOOKUP($A8,'Weekly Schedule'!$A$4:$G$21,1+D$24,FALSE)=\"BYE\",\"BYE\",1+MAX(D$3:D7))","v":{"$error":"#N/A"}},{"$f":"IF(VLOOKUP($A8,'Weekly Schedule'!$A$4:$G$21,1+E$24,FALSE)=\"BYE\",\"BYE\",1+MAX(E$3:E7))","v":{"$error":"#N/A"}},{"$f":"IF(VLOOKUP($A8,'Weekly Schedule'!$A$4:$G$21,1+F$24,FALSE)=\"BYE\",\"BYE\",1+MAX(F$3:F7))","v":{"$error":"#N/A"}},{"$f":"IF(VLOOKUP($A8,'Weekly Schedule'!$A$4:$G$21,1+G$24,FALSE)=\"BYE\",\"BYE\",1+MAX(G$3:G7))","v":{"$error":"#N/A"}}]
{"$rows_left_out":18}